BDBM50294484 2-amino-4-(((2S,3S,4R,5R)-5-(7-amino-3H-imidazo[4,5-b]pyridin-3-yl)-3,4-dihydroxy-tetrahydrofuran-2-yl)methylthio)butanoic acid::CHEMBL563946
SMILES NC(CCSC[C@H]1O[C@H]([C@H](O)[C@@H]1O)n1cnc2c(N)ccnc12)C(O)=O
InChI Key InChIKey=RSRCFARQVZZYKV-QZBYRPAYSA-N
Data  2 IC50
  Tab Delimited (TSV)   2D SDfile   Computed 3D by Vconf -m prep SDfile
Find this compound or compounds like it in BindingDB:
Activity Spreadsheet -- Enzyme Inhibition Constant Data from BindingDB
Found 1 hit for monomerid = 50294484
TargetDNA (cytosine-5)-methyltransferase 1(Homo sapiens (Human))
Methylgene
Curated by ChEMBL
LigandPNGBDBM50294484(2-amino-4-(((2S,3S,4R,5R)-5-(7-amino-3H-imidazo[4,...)
Affinity DataIC50:  4.50E+4nM. Assay description: Inhibition of human recombinant DNMT1 expressed in baculovirus infected high five insect cells
In DepthDetails ArticlePubMed